{"text_format":"1","workbook":"xlsx","n_sheets":5,"sheets":["Introduction","Scenarios","Soft","Medium","Strong"],"not_rendered":{"charts":0,"images":5,"macros":1,"external_links":0,"defined_names":0,"comments":0,"pivot_tables":0},"unopened":[],"bounds":{"document_bytes":16777216,"sheet_cells":100000,"rows_first":2000,"rows_last":500,"rows_between":2000,"halvings":0,"cell_chars":16384,"cell_head_chars":4096},"cells_cut":0,"cells_raw":0,"read":"whole","date_system":"1900"}

{"sheet":"Introduction","index":0,"n_rows":30,"n_cols":1,"rows_kept":30,"cut":false,"hidden":false,"merged":[]}
[]
[]
[]
[]
[]
[]
[]
[]
[]
[]
{"$rows_left_out":21}
{"sheet":"Scenarios","index":1,"n_rows":61,"n_cols":7,"rows_kept":61,"cut":false,"hidden":false,"merged":[[0,3,0,5]]}
["Select scenario","Soft",null,"MCA Self-Assessment "]
[]
[{"$f":"IFERROR(\n   IF(OR(\n      INDEX(INDIRECT(\"'\"&$B$1&\"'!A:G\"), ROW(A1), COLUMN(A1))=0,\n      INDEX(INDIRECT(\"'\"&$B$1&\"'!A:G\"), ROW(A1), COLUMN(A1))=\"\"\n   ),\n   \"\",\n   INDEX(INDIRECT(\"'\"&$B$1&\"'!A:G\"), ROW(A1), COLUMN(A1))\n),\n\"\")","v":"Pillar"},{"$f":"IFERROR(\n   IF(OR(\n      INDEX(INDIRECT(\"'\"&$B$1&\"'!A:G\"), ROW(B1), COLUMN(B1))=0,\n      INDEX(INDIRECT(\"'\"&$B$1&\"'!A:G\"), ROW(B1), COLUMN(B1))=\"\"\n   ),\n   \"\",\n   INDEX(INDIRECT(\"'\"&$B$1&\"'!A:G\"), ROW(B1), COLUMN(B1))\n),\n\"\")","v":"Sector"},{"$f":"IFERROR(\n   IF(OR(\n      INDEX(INDIRECT(\"'\"&$B$1&\"'!A:G\"), ROW(C1), COLUMN(C1))=0,\n      INDEX(INDIRECT(\"'\"&$B$1&\"'!A:G\"), ROW(C1), COLUMN(C1))=\"\"\n   ),\n   \"\",\n   INDEX(INDIRECT(\"'\"&$B$1&\"'!A:G\"), ROW(C1), COLUMN(C1))\n),\n\"\")","v":"Name "},{"$f":"IFERROR(\n   IF(OR(\n      INDEX(INDIRECT(\"'\"&$B$1&\"'!A:G\"), ROW(D1), COLUMN(D1))=0,\n      INDEX(INDIRECT(\"'\"&$B$1&\"'!A:G\"), ROW(D1), COLUMN(D1))=\"\"\n   ),\n   \"\",\n   INDEX(INDIRECT(\"'\"&$B$1&\"'!A:G\"), ROW(D1), COLUMN(D1))\n),\n\"\")","v":"Metric"},{"$f":"IFERROR(\n   IF(OR(\n      INDEX(INDIRECT(\"'\"&$B$1&\"'!A:G\"), ROW(E1), COLUMN(E1))=0,\n      INDEX(INDIRECT(\"'\"&$B$1&\"'!A:G\"), ROW(E1), COLUMN(E1))=\"\"\n   ),\n   \"\",\n   INDEX(INDIRECT(\"'\"&$B$1&\"'!A:G\"), ROW(E1), COLUMN(E1))\n),\n\"\")","v":"Short description"},{"$f":"IFERROR(\n   IF(OR(\n      INDEX(INDIRECT(\"'\"&$B$1&\"'!A:G\"), ROW(F1), COLUMN(F1))=0,\n      INDEX(INDIRECT(\"'\"&$B$1&\"'!A:G\"), ROW(F1), COLUMN(F1))=\"\"\n   ),\n   \"\",\n   INDEX(INDIRECT(\"'\"&$B$1&\"'!A:G\"), ROW(F1), COLUMN(F1))\n),\n\"\")","v":"Source"},{"$f":"IFERROR(\n   IF(OR(\n      INDEX(INDIRECT(\"'\"&$B$1&\"'!A:G\"), ROW(G1), COLUMN(G1))=0,\n      INDEX(INDIRECT(\"'\"&$B$1&\"'!A:G\"), ROW(G1), COLUMN(G1))=\"\"\n   ),\n   \"\",\n   INDEX(INDIRECT(\"'\"&$B$1&\"'!A:G\"), ROW(G1), COLUMN(G1))\n),\n\"\")","v":"Comment"}]
[{"$f":"IFERROR(\n   IF(OR(\n      INDEX(INDIRECT(\"'\"&$B$1&\"'!A:G\"), ROW(A2), COLUMN(A2))=0,\n      INDEX(INDIRECT(\"'\"&$B$1&\"'!A:G\"), ROW(A2), COLUMN(A2))=\"\"\n   ),\n   \"\",\n   INDEX(INDIRECT(\"'\"&$B$1&\"'!A:G\"), ROW(A2), COLUMN(A2))\n),\n\"\")","v":"Society"},{"$f":"IFERROR(\n   IF(OR(\n      INDEX(INDIRECT(\"'\"&$B$1&\"'!A:G\"), ROW(B2), COLUMN(B2))=0,\n      INDEX(INDIRECT(\"'\"&$B$1&\"'!A:G\"), ROW(B2), COLUMN(B2))=\"\"\n   ),\n   \"\",\n   INDEX(INDIRECT(\"'\"&$B$1&\"'!A:G\"), ROW(B2), COLUMN(B2))\n),\n\"\")","v":"All sectors"},{"$f":"IFERROR(\n   IF(OR(\n      INDEX(INDIRECT(\"'\"&$B$1&\"'!A:G\"), ROW(C2), COLUMN(C2))=0,\n      INDEX(INDIRECT(\"'\"&$B$1&\"'!A:G\"), ROW(C2), COLUMN(C2))=\"\"\n   ),\n   \"\",\n   INDEX(INDIRECT(\"'\"&$B$1&\"'!A:G\"), ROW(C2), COLUMN(C2))\n),\n\"\")","v":"Basic education"},{"$f":"IFERROR(\n   IF(OR(\n      INDEX(INDIRECT(\"'\"&$B$1&\"'!A:G\"), ROW(D2), COLUMN(D2))=0,\n      INDEX(INDIRECT(\"'\"&$B$1&\"'!A:G\"), ROW(D2), COLUMN(D2))=\"\"\n   ),\n   \"\",\n   INDEX(INDIRECT(\"'\"&$B$1&\"'!A:G\"), ROW(D2), COLUMN(D2))\n),\n\"\")","v":"Number"},{"$f":"IFERROR(\n   IF(OR(\n      INDEX(INDIRECT(\"'\"&$B$1&\"'!A:G\"), ROW(E2), COLUMN(E2))=0,\n      INDEX(INDIRECT(\"'\"&$B$1&\"'!A:G\"), ROW(E2), COLUMN(E2))=\"\"\n   ),\n   \"\",\n   INDEX(INDIRECT(\"'\"&$B$1&\"'!A:G\"), ROW(E2), COLUMN(E2))\n),\n\"\")","v":"INDEX=100- RCI (EU Regional Competitiveness Index) Sub-indicator"},{"$f":"IFERROR(\n   IF(OR(\n      INDEX(INDIRECT(\"'\"&$B$1&\"'!A:G\"), ROW(F2), COLUMN(F2))=0,\n      INDEX(INDIRECT(\"'\"&$B$1&\"'!A:G\"), ROW(F2), COLUMN(F2))=\"\"\n   ),\n   \"\",\n   INDEX(INDIRECT(\"'\"&$B$1&\"'!A:G\"), ROW(F2), COLUMN(F2))\n),\n\"\")","v":"https://ec.europa.eu/regional_policy/sources/work/rci_2022/eu-rci2_0-2022_en.pdf"},{"$f":"IFERROR(\n   IF(OR(\n      INDEX(INDIRECT(\"'\"&$B$1&\"'!A:G\"), ROW(G2), COLUMN(G2))=0,\n      INDEX(INDIRECT(\"'\"&$B$1&\"'!A:G\"), ROW(G2), COLUMN(G2))=\"\"\n   ),\n   \"\",\n   INDEX(INDIRECT(\"'\"&$B$1&\"'!A:G\"), ROW(G2), COLUMN(G2))\n),\n\"\")","v":"Regional data are easily accessible through the link provided at the Source column"}]
[{"$f":"IFERROR(\n   IF(OR(\n      INDEX(INDIRECT(\"'\"&$B$1&\"'!A:G\"), ROW(A3), COLUMN(A3))=0,\n      INDEX(INDIRECT(\"'\"&$B$1&\"'!A:G\"), ROW(A3), COLUMN(A3))=\"\"\n   ),\n   \"\",\n   INDEX(INDIRECT(\"'\"&$B$1&\"'!A:G\"), ROW(A3), COLUMN(A3))\n),\n\"\")","v":"Society"},{"$f":"IFERROR(\n   IF(OR(\n      INDEX(INDIRECT(\"'\"&$B$1&\"'!A:G\"), ROW(B3), COLUMN(B3))=0,\n      INDEX(INDIRECT(\"'\"&$B$1&\"'!A:G\"), ROW(B3), COLUMN(B3))=\"\"\n   ),\n   \"\",\n   INDEX(INDIRECT(\"'\"&$B$1&\"'!A:G\"), ROW(B3), COLUMN(B3))\n),\n\"\")","v":"All sectors"},{"$f":"IFERROR(\n   IF(OR(\n      INDEX(INDIRECT(\"'\"&$B$1&\"'!A:G\"), ROW(C3), COLUMN(C3))=0,\n      INDEX(INDIRECT(\"'\"&$B$1&\"'!A:G\"), ROW(C3), COLUMN(C3))=\"\"\n   ),\n   \"\",\n   INDEX(INDIRECT(\"'\"&$B$1&\"'!A:G\"), ROW(C3), COLUMN(C3))\n),\n\"\")","v":"Gender employment gap"},{"$f":"IFERROR(\n   IF(OR(\n      INDEX(INDIRECT(\"'\"&$B$1&\"'!A:G\"), ROW(D3), COLUMN(D3))=0,\n      INDEX(INDIRECT(\"'\"&$B$1&\"'!A:G\"), ROW(D3), COLUMN(D3))=\"\"\n   ),\n   \"\",\n   INDEX(INDIRECT(\"'\"&$B$1&\"'!A:G\"), ROW(D3), COLUMN(D3))\n),\n\"\")","v":"%"},{"$f":"IFERROR(\n   IF(OR(\n      INDEX(INDIRECT(\"'\"&$B$1&\"'!A:G\"), ROW(E3), COLUMN(E3))=0,\n      INDEX(INDIRECT(\"'\"&$B$1&\"'!A:G\"), ROW(E3), COLUMN(E3))=\"\"\n   ),\n   \"\",\n   INDEX(INDIRECT(\"'\"&$B$1&\"'!A:G\"), ROW(E3), COLUMN(E3))\n),\n\"\")","v":"Percentage change of gender employment to total employment"},{"$f":"IFERROR(\n   IF(OR(\n      INDEX(INDIRECT(\"'\"&$B$1&\"'!A:G\"), ROW(F3), COLUMN(F3))=0,\n      INDEX(INDIRECT(\"'\"&$B$1&\"'!A:G\"), ROW(F3), COLUMN(F3))=\"\"\n   ),\n   \"\",\n   INDEX(INDIRECT(\"'\"&$B$1&\"'!A:G\"), ROW(F3), COLUMN(F3))\n),\n\"\")","v":"https://ec.europa.eu/eurostat/databrowser/view/tepsr_lm220/default/table?lang=en"},{"$f":"IFERROR(\n   IF(OR(\n      INDEX(INDIRECT(\"'\"&$B$1&\"'!A:G\"), ROW(G3), COLUMN(G3))=0,\n      INDEX(INDIRECT(\"'\"&$B$1&\"'!A:G\"), ROW(G3), COLUMN(G3))=\"\"\n   ),\n   \"\",\n   INDEX(INDIRECT(\"'\"&$B$1&\"'!A:G\"), ROW(G3), COLUMN(G3))\n),\n\"\")","v":"Regional data are easily accessible through the link provided at the Source column"}]
[{"$f":"IFERROR(\n   IF(OR(\n      INDEX(INDIRECT(\"'\"&$B$1&\"'!A:G\"), ROW(A4), COLUMN(A4))=0,\n      INDEX(INDIRECT(\"'\"&$B$1&\"'!A:G\"), ROW(A4), COLUMN(A4))=\"\"\n   ),\n   \"\",\n   INDEX(INDIRECT(\"'\"&$B$1&\"'!A:G\"), ROW(A4), COLUMN(A4))\n),\n\"\")","v":"Society"},{"$f":"IFERROR(\n   IF(OR(\n      INDEX(INDIRECT(\"'\"&$B$1&\"'!A:G\"), ROW(B4), COLUMN(B4))=0,\n      INDEX(INDIRECT(\"'\"&$B$1&\"'!A:G\"), ROW(B4), COLUMN(B4))=\"\"\n   ),\n   \"\",\n   INDEX(INDIRECT(\"'\"&$B$1&\"'!A:G\"), ROW(B4), COLUMN(B4))\n),\n\"\")","v":"All sectors"},{"$f":"IFERROR(\n   IF(OR(\n      INDEX(INDIRECT(\"'\"&$B$1&\"'!A:G\"), ROW(C4), COLUMN(C4))=0,\n      INDEX(INDIRECT(\"'\"&$B$1&\"'!A:G\"), ROW(C4), COLUMN(C4))=\"\"\n   ),\n   \"\",\n   INDEX(INDIRECT(\"'\"&$B$1&\"'!A:G\"), ROW(C4), COLUMN(C4))\n),\n\"\")","v":"Health pillar"},{"$f":"IFERROR(\n   IF(OR(\n      INDEX(INDIRECT(\"'\"&$B$1&\"'!A:G\"), ROW(D4), COLUMN(D4))=0,\n      INDEX(INDIRECT(\"'\"&$B$1&\"'!A:G\"), ROW(D4), COLUMN(D4))=\"\"\n   ),\n   \"\",\n   INDEX(INDIRECT(\"'\"&$B$1&\"'!A:G\"), ROW(D4), COLUMN(D4))\n),\n\"\")","v":"Number"},{"$f":"IFERROR(\n   IF(OR(\n      INDEX(INDIRECT(\"'\"&$B$1&\"'!A:G\"), ROW(E4), COLUMN(E4))=0,\n      INDEX(INDIRECT(\"'\"&$B$1&\"'!A:G\"), ROW(E4), COLUMN(E4))=\"\"\n   ),\n   \"\",\n   INDEX(INDIRECT(\"'\"&$B$1&\"'!A:G\"), ROW(E4), COLUMN(E4))\n),\n\"\")","v":"INDEX=100- RCI Sub-indicator"},{"$f":"IFERROR(\n   IF(OR(\n      INDEX(INDIRECT(\"'\"&$B$1&\"'!A:G\"), ROW(F4), COLUMN(F4))=0,\n      INDEX(INDIRECT(\"'\"&$B$1&\"'!A:G\"), ROW(F4), COLUMN(F4))=\"\"\n   ),\n   \"\",\n   INDEX(INDIRECT(\"'\"&$B$1&\"'!A:G\"), ROW(F4), COLUMN(F4))\n),\n\"\")","v":"https://ec.europa.eu/regional_policy/assets/regional-competitiveness/index.html#/"},{"$f":"IFERROR(\n   IF(OR(\n      INDEX(INDIRECT(\"'\"&$B$1&\"'!A:G\"), ROW(G4), COLUMN(G4))=0,\n      INDEX(INDIRECT(\"'\"&$B$1&\"'!A:G\"), ROW(G4), COLUMN(G4))=\"\"\n   ),\n   \"\",\n   INDEX(INDIRECT(\"'\"&$B$1&\"'!A:G\"), ROW(G4), COLUMN(G4))\n),\n\"\")","v":"Regional data are easily accessible through the link provided at the Source column"}]
[{"$f":"IFERROR(\n   IF(OR(\n      INDEX(INDIRECT(\"'\"&$B$1&\"'!A:G\"), ROW(A5), COLUMN(A5))=0,\n      INDEX(INDIRECT(\"'\"&$B$1&\"'!A:G\"), ROW(A5), COLUMN(A5))=\"\"\n   ),\n   \"\",\n   INDEX(INDIRECT(\"'\"&$B$1&\"'!A:G\"), ROW(A5), COLUMN(A5))\n),\n\"\")","v":"Society"},{"$f":"IFERROR(\n   IF(OR(\n      INDEX(INDIRECT(\"'\"&$B$1&\"'!A:G\"), ROW(B5), COLUMN(B5))=0,\n      INDEX(INDIRECT(\"'\"&$B$1&\"'!A:G\"), ROW(B5), COLUMN(B5))=\"\"\n   ),\n   \"\",\n   INDEX(INDIRECT(\"'\"&$B$1&\"'!A:G\"), ROW(B5), COLUMN(B5))\n),\n\"\")","v":"All sectors"},{"$f":"IFERROR(\n   IF(OR(\n      INDEX(INDIRECT(\"'\"&$B$1&\"'!A:G\"), ROW(C5), COLUMN(C5))=0,\n      INDEX(INDIRECT(\"'\"&$B$1&\"'!A:G\"), ROW(C5), COLUMN(C5))=\"\"\n   ),\n   \"\",\n   INDEX(INDIRECT(\"'\"&$B$1&\"'!A:G\"), ROW(C5), COLUMN(C5))\n),\n\"\")","v":"Higher education"},{"$f":"IFERROR(\n   IF(OR(\n      INDEX(INDIRECT(\"'\"&$B$1&\"'!A:G\"), ROW(D5), COLUMN(D5))=0,\n      INDEX(INDIRECT(\"'\"&$B$1&\"'!A:G\"), ROW(D5), COLUMN(D5))=\"\"\n   ),\n   \"\",\n   INDEX(INDIRECT(\"'\"&$B$1&\"'!A:G\"), ROW(D5), COLUMN(D5))\n),\n\"\")","v":"Number"},{"$f":"IFERROR(\n   IF(OR(\n      INDEX(INDIRECT(\"'\"&$B$1&\"'!A:G\"), ROW(E5), COLUMN(E5))=0,\n      INDEX(INDIRECT(\"'\"&$B$1&\"'!A:G\"), ROW(E5), COLUMN(E5))=\"\"\n   ),\n   \"\",\n   INDEX(INDIRECT(\"'\"&$B$1&\"'!A:G\"), ROW(E5), COLUMN(E5))\n),\n\"\")","v":"Based on the EU Regional Competitiveness Index"},{"$f":"IFERROR(\n   IF(OR(\n      INDEX(INDIRECT(\"'\"&$B$1&\"'!A:G\"), ROW(F5), COLUMN(F5))=0,\n      INDEX(INDIRECT(\"'\"&$B$1&\"'!A:G\"), ROW(F5), COLUMN(F5))=\"\"\n   ),\n   \"\",\n   INDEX(INDIRECT(\"'\"&$B$1&\"'!A:G\"), ROW(F5), COLUMN(F5))\n),\n\"\")","v":"https://ec.europa.eu/regional_policy/assets/regional-competitiveness/index.html#/"},{"$f":"IFERROR(\n   IF(OR(\n      INDEX(INDIRECT(\"'\"&$B$1&\"'!A:G\"), ROW(G5), COLUMN(G5))=0,\n      INDEX(INDIRECT(\"'\"&$B$1&\"'!A:G\"), ROW(G5), COLUMN(G5))=\"\"\n   ),\n   \"\",\n   INDEX(INDIRECT(\"'\"&$B$1&\"'!A:G\"), ROW(G5), COLUMN(G5))\n),\n\"\")","v":"Regional data are easily accessible through the link provided at the Source column"}]
[{"$f":"IFERROR(\n   IF(OR(\n      INDEX(INDIRECT(\"'\"&$B$1&\"'!A:G\"), ROW(A6), COLUMN(A6))=0,\n      INDEX(INDIRECT(\"'\"&$B$1&\"'!A:G\"), ROW(A6), COLUMN(A6))=\"\"\n   ),\n   \"\",\n   INDEX(INDIRECT(\"'\"&$B$1&\"'!A:G\"), ROW(A6), COLUMN(A6))\n),\n\"\")","v":"Society"},{"$f":"IFERROR(\n   IF(OR(\n      INDEX(INDIRECT(\"'\"&$B$1&\"'!A:G\"), ROW(B6), COLUMN(B6))=0,\n      INDEX(INDIRECT(\"'\"&$B$1&\"'!A:G\"), ROW(B6), COLUMN(B6))=\"\"\n   ),\n   \"\",\n   INDEX(INDIRECT(\"'\"&$B$1&\"'!A:G\"), ROW(B6), COLUMN(B6))\n),\n\"\")","v":"All sectors"},{"$f":"IFERROR(\n   IF(OR(\n      INDEX(INDIRECT(\"'\"&$B$1&\"'!A:G\"), ROW(C6), COLUMN(C6))=0,\n      INDEX(INDIRECT(\"'\"&$B$1&\"'!A:G\"), ROW(C6), COLUMN(C6))=\"\"\n   ),\n   \"\",\n   INDEX(INDIRECT(\"'\"&$B$1&\"'!A:G\"), ROW(C6), COLUMN(C6))\n),\n\"\")","v":"Life expectancy at birth"},{"$f":"IFERROR(\n   IF(OR(\n      INDEX(INDIRECT(\"'\"&$B$1&\"'!A:G\"), ROW(D6), COLUMN(D6))=0,\n      INDEX(INDIRECT(\"'\"&$B$1&\"'!A:G\"), ROW(D6), COLUMN(D6))=\"\"\n   ),\n   \"\",\n   INDEX(INDIRECT(\"'\"&$B$1&\"'!A:G\"), ROW(D6), COLUMN(D6))\n),\n\"\")","v":"Years"},{"$f":"IFERROR(\n   IF(OR(\n      INDEX(INDIRECT(\"'\"&$B$1&\"'!A:G\"), ROW(E6), COLUMN(E6))=0,\n      INDEX(INDIRECT(\"'\"&$B$1&\"'!A:G\"), ROW(E6), COLUMN(E6))=\"\"\n   ),\n   \"\",\n   INDEX(INDIRECT(\"'\"&$B$1&\"'!A:G\"), ROW(E6), COLUMN(E6))\n),\n\"\")","v":"(Number of years a new-born infant would live if prevailing patterns of mortality at the time of its birth were to stay the same throughout its life)"},{"$f":"IFERROR(\n   IF(OR(\n      INDEX(INDIRECT(\"'\"&$B$1&\"'!A:G\"), ROW(F6), COLUMN(F6))=0,\n      INDEX(INDIRECT(\"'\"&$B$1&\"'!A:G\"), ROW(F6), COLUMN(F6))=\"\"\n   ),\n   \"\",\n   INDEX(INDIRECT(\"'\"&$B$1&\"'!A:G\"), ROW(F6), COLUMN(F6))\n),\n\"\")","v":"https://ec.europa.eu/eurostat/databrowser/view/tgs00101/default/table?lang=en&category=t_demo.t_demofmreg"},{"$f":"IFERROR(\n   IF(OR(\n      INDEX(INDIRECT(\"'\"&$B$1&\"'!A:G\"), ROW(G6), COLUMN(G6))=0,\n      INDEX(INDIRECT(\"'\"&$B$1&\"'!A:G\"), ROW(G6), COLUMN(G6))=\"\"\n   ),\n   \"\",\n   INDEX(INDIRECT(\"'\"&$B$1&\"'!A:G\"), ROW(G6), COLUMN(G6))\n),\n\"\")","v":"Regional data are easily accessible through the link provided at the Source column"}]
[{"$f":"IFERROR(\n   IF(OR(\n      INDEX(INDIRECT(\"'\"&$B$1&\"'!A:G\"), ROW(A7), COLUMN(A7))=0,\n      INDEX(INDIRECT(\"'\"&$B$1&\"'!A:G\"), ROW(A7), COLUMN(A7))=\"\"\n   ),\n   \"\",\n   INDEX(INDIRECT(\"'\"&$B$1&\"'!A:G\"), ROW(A7), COLUMN(A7))\n),\n\"\")","v":"Society"},{"$f":"IFERROR(\n   IF(OR(\n      INDEX(INDIRECT(\"'\"&$B$1&\"'!A:G\"), ROW(B7), COLUMN(B7))=0,\n      INDEX(INDIRECT(\"'\"&$B$1&\"'!A:G\"), ROW(B7), COLUMN(B7))=\"\"\n   ),\n   \"\",\n   INDEX(INDIRECT(\"'\"&$B$1&\"'!A:G\"), ROW(B7), COLUMN(B7))\n),\n\"\")","v":"All sectors"},{"$f":"IFERROR(\n   IF(OR(\n      INDEX(INDIRECT(\"'\"&$B$1&\"'!A:G\"), ROW(C7), COLUMN(C7))=0,\n      INDEX(INDIRECT(\"'\"&$B$1&\"'!A:G\"), ROW(C7), COLUMN(C7))=\"\"\n   ),\n   \"\",\n   INDEX(INDIRECT(\"'\"&$B$1&\"'!A:G\"), ROW(C7), COLUMN(C7))\n),\n\"\")","v":"Population 15-64 years"},{"$f":"IFERROR(\n   IF(OR(\n      INDEX(INDIRECT(\"'\"&$B$1&\"'!A:G\"), ROW(D7), COLUMN(D7))=0,\n      INDEX(INDIRECT(\"'\"&$B$1&\"'!A:G\"), ROW(D7), COLUMN(D7))=\"\"\n   ),\n   \"\",\n   INDEX(INDIRECT(\"'\"&$B$1&\"'!A:G\"), ROW(D7), COLUMN(D7))\n),\n\"\")","v":"Number"},{"$f":"IFERROR(\n   IF(OR(\n      INDEX(INDIRECT(\"'\"&$B$1&\"'!A:G\"), ROW(E7), COLUMN(E7))=0,\n      INDEX(INDIRECT(\"'\"&$B$1&\"'!A:G\"), ROW(E7), COLUMN(E7))=\"\"\n   ),\n   \"\",\n   INDEX(INDIRECT(\"'\"&$B$1&\"'!A:G\"), ROW(E7), COLUMN(E7))\n),\n\"\")","v":"Absolute number "},{"$f":"IFERROR(\n   IF(OR(\n      INDEX(INDIRECT(\"'\"&$B$1&\"'!A:G\"), ROW(F7), COLUMN(F7))=0,\n      INDEX(INDIRECT(\"'\"&$B$1&\"'!A:G\"), ROW(F7), COLUMN(F7))=\"\"\n   ),\n   \"\",\n   INDEX(INDIRECT(\"'\"&$B$1&\"'!A:G\"), ROW(F7), COLUMN(F7))\n),\n\"\")","v":"https://ec.europa.eu/eurostat/databrowser/view/DEMO_R_PJANGROUP/default/table?lang=en"},{"$f":"IFERROR(\n   IF(OR(\n      INDEX(INDIRECT(\"'\"&$B$1&\"'!A:G\"), ROW(G7), COLUMN(G7))=0,\n      INDEX(INDIRECT(\"'\"&$B$1&\"'!A:G\"), ROW(G7), COLUMN(G7))=\"\"\n   ),\n   \"\",\n   INDEX(INDIRECT(\"'\"&$B$1&\"'!A:G\"), ROW(G7), COLUMN(G7))\n),\n\"\")","v":"Regional data are easily accessible through the link provided at the Source column"}]
[{"$f":"IFERROR(\n   IF(OR(\n      INDEX(INDIRECT(\"'\"&$B$1&\"'!A:G\"), ROW(A8), COLUMN(A8))=0,\n      INDEX(INDIRECT(\"'\"&$B$1&\"'!A:G\"), ROW(A8), COLUMN(A8))=\"\"\n   ),\n   \"\",\n   INDEX(INDIRECT(\"'\"&$B$1&\"'!A:G\"), ROW(A8), COLUMN(A8))\n),\n\"\")","v":"Society"},{"$f":"IFERROR(\n   IF(OR(\n      INDEX(INDIRECT(\"'\"&$B$1&\"'!A:G\"), ROW(B8), COLUMN(B8))=0,\n      INDEX(INDIRECT(\"'\"&$B$1&\"'!A:G\"), ROW(B8), COLUMN(B8))=\"\"\n   ),\n   \"\",\n   INDEX(INDIRECT(\"'\"&$B$1&\"'!A:G\"), ROW(B8), COLUMN(B8))\n),\n\"\")","v":"Agriculture"},{"$f":"IFERROR(\n   IF(OR(\n      INDEX(INDIRECT(\"'\"&$B$1&\"'!A:G\"), ROW(C8), COLUMN(C8))=0,\n      INDEX(INDIRECT(\"'\"&$B$1&\"'!A:G\"), ROW(C8), COLUMN(C8))=\"\"\n   ),\n   \"\",\n   INDEX(INDIRECT(\"'\"&$B$1&\"'!A:G\"), ROW(C8), COLUMN(C8))\n),\n\"\")","v":"Ha of land set aside for food growing (or percentage of the total land used)"},{"$f":"IFERROR(\n   IF(OR(\n      INDEX(INDIRECT(\"'\"&$B$1&\"'!A:G\"), ROW(D8), COLUMN(D8))=0,\n      INDEX(INDIRECT(\"'\"&$B$1&\"'!A:G\"), ROW(D8), COLUMN(D8))=\"\"\n   ),\n   \"\",\n   INDEX(INDIRECT(\"'\"&$B$1&\"'!A:G\"), ROW(D8), COLUMN(D8))\n),\n\"\")","v":"%"},{"$f":"IFERROR(\n   IF(OR(\n      INDEX(INDIRECT(\"'\"&$B$1&\"'!A:G\"), ROW(E8), COLUMN(E8))=0,\n      INDEX(INDIRECT(\"'\"&$B$1&\"'!A:G\"), ROW(E8), COLUMN(E8))=\"\"\n   ),\n   \"\",\n   INDEX(INDIRECT(\"'\"&$B$1&\"'!A:G\"), ROW(E8), COLUMN(E8))\n),\n\"\")","v":""},{"$f":"IFERROR(\n   IF(OR(\n      INDEX(INDIRECT(\"'\"&$B$1&\"'!A:G\"), ROW(F8), COLUMN(F8))=0,\n      INDEX(INDIRECT(\"'\"&$B$1&\"'!A:G\"), ROW(F8), COLUMN(F8))=\"\"\n   ),\n   \"\",\n   INDEX(INDIRECT(\"'\"&$B$1&\"'!A:G\"), ROW(F8), COLUMN(F8))\n),\n\"\")","v":""},{"$f":"IFERROR(\n   IF(OR(\n      INDEX(INDIRECT(\"'\"&$B$1&\"'!A:G\"), ROW(G8), COLUMN(G8))=0,\n      INDEX(INDIRECT(\"'\"&$B$1&\"'!A:G\"), ROW(G8), COLUMN(G8))=\"\"\n   ),\n   \"\",\n   INDEX(INDIRECT(\"'\"&$B$1&\"'!A:G\"), ROW(G8), COLUMN(G8))\n),\n\"\")","v":"Regional data are not available. Consider exchanges with agricultural stakeholders e.g. farmers association"}]
{"$rows_left_out":52}
{"sheet":"Soft","index":2,"n_rows":25,"n_cols":7,"rows_kept":25,"cut":false,"hidden":false,"merged":[]}
["Pillar","Sector","Name ","Metric","Short description","Source","Comment"]
["Society","All sectors","Basic education","Number","INDEX=100- RCI (EU Regional Competitiveness Index) Sub-indicator","https://ec.europa.eu/regional_policy/sources/work/rci_2022/eu-rci2_0-2022_en.pdf","Regional data are easily accessible through the link provided at the Source column"]
["Society","All sectors","Gender employment gap","%","Percentage change of gender employment to total employment","https://ec.europa.eu/eurostat/databrowser/view/tepsr_lm220/default/table?lang=en","Regional data are easily accessible through the link provided at the Source column"]
["Society","All sectors","Health pillar","Number","INDEX=100- RCI Sub-indicator","https://ec.europa.eu/regional_policy/assets/regional-competitiveness/index.html#/","Regional data are easily accessible through the link provided at the Source column"]
["Society","All sectors","Higher education","Number","Based on the EU Regional Competitiveness Index","https://ec.europa.eu/regional_policy/assets/regional-competitiveness/index.html#/","Regional data are easily accessible through the link provided at the Source column"]
["Society","All sectors","Life expectancy at birth","Years","(Number of years a new-born infant would live if prevailing patterns of mortality at the time of its birth were to stay the same throughout its life)","https://ec.europa.eu/eurostat/databrowser/view/tgs00101/default/table?lang=en&category=t_demo.t_demofmreg","Regional data are easily accessible through the link provided at the Source column"]
["Society","All sectors","Population 15-64 years","Number","Absolute number ","https://ec.europa.eu/eurostat/databrowser/view/DEMO_R_PJANGROUP/default/table?lang=en","Regional data are easily accessible through the link provided at the Source column"]
["Society","Agriculture","Ha of land set aside for food growing (or percentage of the total land used)","%",null,null,"Regional data are not available. Consider exchanges with agricultural stakeholders e.g. farmers association"]
["Society","All sectors","Population growth","%","% Year",null,"National statistics should provide it at the regional level"]
["Society","All sectors","Employment in total bioeconomy sector as % of total employment in region","%",null,"https://datam.jrc.ec.europa.eu/datam/mashup/BIOECONOMICS/","if data are not available by regional statistics for each sector on employment, exchange with key stakeholders such a public regional employment offices,  development agencies or chambers of commerce"]
{"$rows_left_out":16}
{"sheet":"Medium","index":3,"n_rows":49,"n_cols":7,"rows_kept":49,"cut":false,"hidden":false,"merged":[]}
["Pillar","Sector","Name ","Metric","Short description","Source","Comment"]
["Society","All sectors","Basic education","Number","INDEX=100- RCI (EU Regional Competitiveness Index) Sub-indicator","https://ec.europa.eu/regional_policy/sources/work/rci_2022/eu-rci2_0-2022_en.pdf","Regional data are easily accessible through the link provided at the Source column"]
["Society","All sectors","Gender employment gap","%","Percentage change of gender employment to total employment","https://ec.europa.eu/eurostat/databrowser/view/tepsr_lm220/default/table?lang=en","Regional data are easily accessible through the link provided at the Source column"]
["Society","All sectors","Health pillar","Number","INDEX=100- RCI Sub-indicator","https://ec.europa.eu/regional_policy/assets/regional-competitiveness/index.html#/","Regional data are easily accessible through the link provided at the Source column"]
["Society","All sectors","Higher education","Number","Based on the EU Regional Competitiveness Index","https://ec.europa.eu/regional_policy/assets/regional-competitiveness/index.html#/","Regional data are easily accessible through the link provided at the Source column"]
["Society","All sectors","Life expectancy at birth","Years","(Number of years a new-born infant would live if prevailing patterns of mortality at the time of its birth were to stay the same throughout its life)","https://ec.europa.eu/eurostat/databrowser/view/tgs00101/default/table?lang=en&category=t_demo.t_demofmreg","Regional data are easily accessible through the link provided at the Source column"]
["Society","All sectors","Population 15-64 years","Number","Absolute number ","https://ec.europa.eu/eurostat/databrowser/view/DEMO_R_PJANGROUP/default/table?lang=en","Regional data are easily accessible through the link provided at the Source column"]
["Society","Agriculture","Ha of land set aside for food growing (or percentage of the total land used)","%",null,null,"Regional data are not available. Consider exchanges with agricultural stakeholders e.g. farmers association"]
["Society","All sectors","Population growth","%","% Year",null,"National statistics should provide it at the regional level"]
["Society","All sectors","Employment in total bioeconomy sector as % of total employment in region","%",null,"https://datam.jrc.ec.europa.eu/datam/mashup/BIOECONOMICS/","if data are not available by regional statistics for each sector on employment, exchange with key stakeholders such a public regional employment offices,  development agencies or chambers of commerce"]
{"$rows_left_out":40}
{"sheet":"Strong","index":4,"n_rows":59,"n_cols":7,"rows_kept":59,"cut":false,"hidden":false,"merged":[]}
["Pillar","Sector","Name ","Metric","Short description","Source","Comment"]
["Society","All sectors","Basic education","Number","INDEX=100- RCI (EU Regional Competitiveness Index) Sub-indicator","https://ec.europa.eu/regional_policy/sources/work/rci_2022/eu-rci2_0-2022_en.pdf","Regional data are easily accessible through the link provided at the Source column"]
["Society","All sectors","Gender employment gap","%","Percentage change of gender employment to total employment","https://ec.europa.eu/eurostat/databrowser/view/tepsr_lm220/default/table?lang=en","Regional data are easily accessible through the link provided at the Source column"]
["Society","All sectors","Health pillar","Number","INDEX=100- RCI Sub-indicator","https://ec.europa.eu/regional_policy/assets/regional-competitiveness/index.html#/","Regional data are easily accessible through the link provided at the Source column"]
["Society","All sectors","Higher education","Number","Based on the EU Regional Competitiveness Index","https://ec.europa.eu/regional_policy/assets/regional-competitiveness/index.html#/","Regional data are easily accessible through the link provided at the Source column"]
["Society","All sectors","Life expectancy at birth","Years","(Number of years a new-born infant would live if prevailing patterns of mortality at the time of its birth were to stay the same throughout its life)","https://ec.europa.eu/eurostat/databrowser/view/tgs00101/default/table?lang=en&category=t_demo.t_demofmreg","Regional data are easily accessible through the link provided at the Source column"]
["Society","All sectors","Population 15-64 years","Number","Absolute number ","https://ec.europa.eu/eurostat/databrowser/view/DEMO_R_PJANGROUP/default/table?lang=en","Regional data are easily accessible through the link provided at the Source column"]
["Society","Agriculture","Ha of land set aside for food growing (or percentage of the total land used)","%",null,null,"Regional data are not available. Consider exchanges with agricultural stakeholders e.g. farmers association"]
["Society","All sectors","Population growth","%","% Year",null,"National statistics should provide it at the regional level"]
["Society","All sectors","Employment in total bioeconomy sector as % of total employment in region","%",null,"https://datam.jrc.ec.europa.eu/datam/mashup/BIOECONOMICS/","if data are not available by regional statistics for each sector on employment, exchange with key stakeholders such a public regional employment offices,  development agencies or chambers of commerce"]
{"$rows_left_out":49}